Testbed status

Generated:

Test results

no. machine iStore iGrid jobmans GRIS merge jobmans Gatekeeper gridlab.conf java Mercury compile clean
1 skirit.ics.muni.cz OK OK OK OK OK OK OK fail OK
2 rage1.man.poznan.pl OK fail OK OK OK OK OK OK OK
3 pegasos.icis.pcz.pl OK OK OK OK OK OK OK fail OK
4 eltoro.pcz.pl OK OK OK OK fail prereq prereq prereq prereq
5 ia64.icis.pcz.pl OK OK OK OK fail prereq prereq prereq prereq
6 hitcross.lrz-muenchen.de OK OK OK OK fail not done prereq not done prereq
7 mike4.cct.lsu.edu fail prereq fail prereq OK OK OK OK timeout
8 fs0.das2.cs.vu.nl OK fail fail fail OK fail fail OK fail
9 n0.hpcc.sztaki.hu OK fail OK OK fail prereq prereq prereq prereq
10 bouscat.cs.cf.ac.uk fail prereq fail prereq OK fail OK fail OK
11 grape.man.poznan.pl fail prereq OK OK fail prereq prereq prereq prereq
12 glamdring.zcu.cz OK fail fail fail fail prereq prereq prereq prereq
13 sierra0.unile.it OK fail fail fail fail prereq prereq prereq prereq
14 sigma1.unile.it OK fail fail fail fail prereq prereq prereq prereq
15 peyote.aei.mpg.de fail prereq fail prereq fail prereq prereq prereq prereq
16 ibun.ics.muni.cz fail prereq fail prereq fail prereq prereq prereq prereq
17 cluster3.zib.de fail prereq fail prereq fail prereq prereq prereq prereq
18 gridentry.uni-paderborn.de fail prereq fail prereq fail prereq prereq prereq prereq
19 sr8000.lrz-muenchen.de fail prereq timeout prereq fail not done not done not done not done
20 packcs-e0.scai.fraunhofer.de fail prereq fail prereq fail prereq prereq prereq prereq
21 helix.bcvc.lsu.edu fail prereq fail prereq fail prereq prereq prereq prereq
22 venus.gridcenter.or.kr fail prereq fail prereq fail prereq prereq prereq prereq
23 pclab120.telecom.ece.ntua.gr fail prereq fail prereq fail prereq prereq prereq prereq

Machine list

no. machine admin jobmanagers os cpu
1 skirit.ics.muni.cz Mirek Ruda jobmanager-pbs jobmanager-fork - - MHz
2 rage1.man.poznan.pl Bogdan Ludwiczak jobmanager-pbs jobmanager-fork - - MHz
3 pegasos.icis.pcz.pl Konrad Karczewski jobmanager-fork - - MHz
4 eltoro.pcz.pl Konrad Karczewski jobmanager-fork - - MHz
5 ia64.icis.pcz.pl Konrad Karczewski jobmanager-fork - - MHz
6 hitcross.lrz-muenchen.de Helmut Heller jobmanager-fork - - MHz
7 mike4.cct.lsu.edu Sam White
8 fs0.das2.cs.vu.nl Kees Verstoep
9 n0.hpcc.sztaki.hu Farkas Zoltan jobmanager-sge jobmanager-condor - - MHz
10 bouscat.cs.cf.ac.uk Jonathan Giddy
11 grape.man.poznan.pl Bogdan Ludwiczak jobmanager-fork jobmanager-lsf IRIX64 6.5 160x MIPS - R12000 - 400 MHz
12 glamdring.zcu.cz Mirek Ruda
13 sierra0.unile.it Massimo Cafaro
14 sigma1.unile.it Massimo Cafaro
15 peyote.aei.mpg.de Marco Ehlert
16 ibun.ics.muni.cz Mirek Ruda
17 cluster3.zib.de Tinosch Kolagheichi-Ganjineh
18 gridentry.uni-paderborn.de Matthias Hovestadt
19 sr8000.lrz-muenchen.de Helmut Heller
20 packcs-e0.scai.fraunhofer.de Wolfgang Ziegler
21 helix.bcvc.lsu.edu Sam White
22 venus.gridcenter.or.kr Jae-Hyuck Kwak
23 pclab120.telecom.ece.ntua.gr Thodoris Polychniatis

Test statistics

Total number of machines 23
different jobmanagers jobmanager-fork,jobmanager-pbs,jobmanager-condor,jobmanager-sge,jobmanager-lsf
different OS 7x ,1x IRIX64
different CPU 1x MIPS

Text output from failed tests

skirit.ics.muni.cz

Mercury compile

unpacking ...
configuring ...
make ...
/usr/bin/make -s -j8 FAILED
last 100 lines of /home/glab010/autotest_mercury/makelog
-------------------------------------
auth-gssapi.c:723: error: dereferencing pointer to incomplete type
auth-gssapi.c:725: error: dereferencing pointer to incomplete type
auth-gssapi.c:727: error: dereferencing pointer to incomplete type
auth-gssapi.c:731: error: dereferencing pointer to incomplete type
auth-gssapi.c:736: error: dereferencing pointer to incomplete type
auth-gssapi.c:740: error: dereferencing pointer to incomplete type
auth-gssapi.c:744: error: dereferencing pointer to incomplete type
auth-gssapi.c:749: error: dereferencing pointer to incomplete type
auth-gssapi.c:751: error: `inbuf' undeclared (first use in this function)
auth-gssapi.c:752: error: dereferencing pointer to incomplete type
auth-gssapi.c:753: error: dereferencing pointer to incomplete type
auth-gssapi.c:755: error: `major_st' undeclared (first use in this function)
auth-gssapi.c:755: warning: implicit declaration of function `gss_unwrap'
auth-gssapi.c:755: error: `minor_st' undeclared (first use in this function)
auth-gssapi.c:755: error: dereferencing pointer to incomplete type
auth-gssapi.c:755: error: `outbuf' undeclared (first use in this function)
auth-gssapi.c:756: error: `qop_state' undeclared (first use in this function)
auth-gssapi.c:791: error: dereferencing pointer to incomplete type
auth-gssapi.c:798: error: dereferencing pointer to incomplete type
auth-gssapi.c:800: error: dereferencing pointer to incomplete type
auth-gssapi.c: In function `bio_gssapi_write':
auth-gssapi.c:808: error: `gss_buffer_desc' undeclared (first use in this function)
auth-gssapi.c:808: error: parse error before "inbuf"
auth-gssapi.c:809: error: `OM_uint32' undeclared (first use in this function)
auth-gssapi.c:818: error: dereferencing pointer to incomplete type
auth-gssapi.c:820: error: dereferencing pointer to incomplete type
auth-gssapi.c:823: error: dereferencing pointer to incomplete type
auth-gssapi.c:826: error: `inbuf' undeclared (first use in this function)
auth-gssapi.c:827: error: dereferencing pointer to incomplete type
auth-gssapi.c:828: error: dereferencing pointer to incomplete type
auth-gssapi.c:831: error: `major_st' undeclared (first use in this function)
auth-gssapi.c:831: warning: implicit declaration of function `gss_wrap'
auth-gssapi.c:831: error: `minor_st' undeclared (first use in this function)
auth-gssapi.c:831: error: dereferencing pointer to incomplete type
auth-gssapi.c:831: error: `GSS_C_QOP_DEFAULT' undeclared (first use in this function)
auth-gssapi.c:832: error: `outbuf' undeclared (first use in this function)
auth-gssapi.c:846: error: dereferencing pointer to incomplete type
auth-gssapi.c:853: error: dereferencing pointer to incomplete type
auth-gssapi.c:854: error: dereferencing pointer to incomplete type
auth-gssapi.c:855: error: dereferencing pointer to incomplete type
auth-gssapi.c:861: error: dereferencing pointer to incomplete type
auth-gssapi.c: In function `bio_gssapi_done':
auth-gssapi.c:871: error: dereferencing pointer to incomplete type
auth-gssapi.c:872: error: dereferencing pointer to incomplete type
auth-gssapi.c:873: error: dereferencing pointer to incomplete type
auth-gssapi.c: In function `bio_gssapi_setup':
auth-gssapi.c:880: error: `OM_uint32' undeclared (first use in this function)
auth-gssapi.c:880: error: parse error before "major_st"
auth-gssapi.c:889: error: invalid application of `sizeof' to an incomplete type
auth-gssapi.c:892: error: dereferencing pointer to incomplete type
auth-gssapi.c:892: error: dereferencing pointer to incomplete type
auth-gssapi.c:896: error: `major_st' undeclared (first use in this function)
auth-gssapi.c:896: warning: implicit declaration of function `gss_wrap_size_limit'
auth-gssapi.c:896: error: `minor_st' undeclared (first use in this function)
auth-gssapi.c:896: error: dereferencing pointer to incomplete type
auth-gssapi.c:897: error: `GSS_C_QOP_DEFAULT' undeclared (first use in this function)
auth-gssapi.c:897: error: dereferencing pointer to incomplete type
auth-gssapi.c: In function `auth_gssapi_module_init':
auth-gssapi.c:917: error: `OM_uint32' undeclared (first use in this function)
auth-gssapi.c:917: error: parse error before "minor_st"
auth-gssapi.c:918: error: `gss_cred_id_t' undeclared (first use in this function)
auth-gssapi.c:919: error: `gss_OID_set' undeclared (first use in this function)
auth-gssapi.c:933: error: `major_st' undeclared (first use in this function)
auth-gssapi.c:933: warning: implicit declaration of function `gss_indicate_mechs'
auth-gssapi.c:933: error: `minor_st' undeclared (first use in this function)
auth-gssapi.c:933: error: `mechs' undeclared (first use in this function)
auth-gssapi.c:941: warning: implicit declaration of function `gss_release_oid_set'
auth-gssapi.c:944: error: `GSS_C_INDEFINITE' undeclared (first use in this function)
auth-gssapi.c:945: error: `GSS_C_NO_OID_SET' undeclared (first use in this function)
auth-gssapi.c:945: error: `GSS_C_BOTH' undeclared (first use in this function)
auth-gssapi.c:945: error: `cred' undeclared (first use in this function)
auth-gssapi.c:965: warning: implicit declaration of function `gsskrb5_register_acceptor_identity'
make[4]: *** [auth_gssapi_la-auth-gssapi.lo] Error 1
make[4]: *** Waiting for unfinished jobs....
router-common.c: In function `metric_info_new':
router-common.c:54: warning: visibility attribute not supported in this configuration; ignored
router-common.c: In function `metric_info_new_ctrl':
router-common.c:74: warning: visibility attribute not supported in this configuration; ignored
router-common.c: In function `metric_info_done':
router-common.c:84: warning: visibility attribute not supported in this configuration; ignored
router-common.c: In function `metric_info_release':
router-common.c:134: warning: visibility attribute not supported in this configuration; ignored
router-common.c: In function `metric_info_stopped':
router-common.c:158: warning: visibility attribute not supported in this configuration; ignored
router-common.c: In function `router_send':
router-common.c:208: warning: visibility attribute not supported in this configuration; ignored
router-common.c: In function `router_detach_ctx':
router-common.c:216: warning: visibility attribute not supported in this configuration; ignored
router-common.c: In function `router_simple_notify':
router-common.c:288: warning: visibility attribute not supported in this configuration; ignored
router-common.c: In function `router_grp_notify':
router-common.c:348: warning: visibility attribute not supported in this configuration; ignored
router-common.c: In function `router_sample':
router-common.c:365: warning: visibility attribute not supported in this configuration; ignored
router-common.c: In function `router_active':
router-common.c:370: warning: visibility attribute not supported in this configuration; ignored
make[3]: *** [all-recursive] Error 1
make[2]: *** [all] Error 2
make[1]: *** [all-recursive] Error 1
make: *** [all-recursive] Error 1
-------------------------------------

rage1.man.poznan.pl

iGrid jobmans

No jobmanagers found in iStore for machine rage1.man.poznan.pl

pegasos.icis.pcz.pl

Mercury compile

unpacking ...
configuring ...
exit=130

eltoro.pcz.pl

Gatekeeper

Data transfer to the server failed [Root error message: null]

gridlab.conf

Gatekeeper failed

java

Gatekeeper failed

Mercury compile

Gatekeeper failed

clean

Gatekeeper failed

ia64.icis.pcz.pl

Gatekeeper

Data transfer to the server failed [Root error message: Authentication failed [Root error message: org.ietf.jgss.GSSException, major code: 11, minor code: 0
	major string: General failure, unspecified at GSSAPI level
	minor string: None [Root error message: Bad certificate]]]

gridlab.conf

Gatekeeper failed

java

Gatekeeper failed

Mercury compile

Gatekeeper failed

clean

Gatekeeper failed

hitcross.lrz-muenchen.de

Gatekeeper

Data transfer to the server failed [Root error message: Authentication failed [Root error message: org.ietf.jgss.GSSException, major code: 11, minor code: 0
	major string: General failure, unspecified at GSSAPI level
	minor string: None [Root error message: Unknown CA]]]

gridlab.conf

disabled

java

Gatekeeper failed

Mercury compile

disabled

clean

Gatekeeper failed

mike4.cct.lsu.edu

iStore

machine mike4.cct.lsu.edu not found in iStore

iGrid jobmans

iStore failed

GRIS

java.net.ConnectException: Connection refused

merge jobmans

both info services (iStore,GRIS) failed

clean

Terminated
cat: /tmp/out.4555: No such file or directory
exit=143

fs0.das2.cs.vu.nl

iGrid jobmans

No jobmanagers found in iStore for machine fs0.das2.cs.vu.nl

GRIS

javax.naming.CommunicationException: Request: 1 cancelled

merge jobmans

GRIS failed, iStore lists no jobmanagers

gridlab.conf

GRAM Job submission failed because authentication failed:
GSS Major Status: Authentication Failed
GSS Minor Status Error Chain:

init.c:499: globus_gss_assist_init_sec_context_async: Error during context initialization
init_sec_context.c:189: gss_init_sec_context: Unable to verify remote side's credentials
globus_i_gsi_gss_utils.c:873: globus_i_gsi_gss_handshake: SSLv3 handshake problems: Couldn't do ssl handshake
OpenSSL Error: s3_clnt.c:836: in library: SSL routines, function SSL3_GET_SERVER_CERTIFICATE: certificate verify failed
globus_gsi_callback.c:351: globus_i_gsi_callback_handshake_callback: Could not verify credential
globus_gsi_callback.c:431: globus_i_gsi_callback_cred_verify: The certificate has expired: Remote credential has expired (error code 7)
exit=7

java

GRAM Job submission failed because authentication failed:
GSS Major Status: Authentication Failed
GSS Minor Status Error Chain:

init.c:499: globus_gss_assist_init_sec_context_async: Error during context initialization
init_sec_context.c:189: gss_init_sec_context: Unable to verify remote side's credentials
globus_i_gsi_gss_utils.c:873: globus_i_gsi_gss_handshake: SSLv3 handshake problems: Couldn't do ssl handshake
OpenSSL Error: s3_clnt.c:836: in library: SSL routines, function SSL3_GET_SERVER_CERTIFICATE: certificate verify failed
globus_gsi_callback.c:351: globus_i_gsi_callback_handshake_callback: Could not verify credential
globus_gsi_callback.c:431: globus_i_gsi_callback_cred_verify: The certificate has expired: Remote credential has expired (error code 7)
exit=7

clean

GRAM Job submission failed because authentication failed:
GSS Major Status: Authentication Failed
GSS Minor Status Error Chain:

init.c:499: globus_gss_assist_init_sec_context_async: Error during context initialization
init_sec_context.c:189: gss_init_sec_context: Unable to verify remote side's credentials
globus_i_gsi_gss_utils.c:873: globus_i_gsi_gss_handshake: SSLv3 handshake problems: Couldn't do ssl handshake
OpenSSL Error: s3_clnt.c:836: in library: SSL routines, function SSL3_GET_SERVER_CERTIFICATE: certificate verify failed
globus_gsi_callback.c:351: globus_i_gsi_callback_handshake_callback: Could not verify credential
globus_gsi_callback.c:431: globus_i_gsi_callback_cred_verify: The certificate has expired: Remote credential has expired (error code 7)
exit=7

n0.hpcc.sztaki.hu

iGrid jobmans

No jobmanagers found in iStore for machine n0.hpcc.sztaki.hu

Gatekeeper

Data transfer to the server failed [Root error message: Authentication failed [Root error message: org.ietf.jgss.GSSException, major code: 11, minor code: 0
	major string: General failure, unspecified at GSSAPI level
	minor string: None [Root error message: Unknown CA]]]

gridlab.conf

Gatekeeper failed

java

Gatekeeper failed

Mercury compile

Gatekeeper failed

clean

Gatekeeper failed

bouscat.cs.cf.ac.uk

iStore

machine bouscat.cs.cf.ac.uk not found in iStore

iGrid jobmans

iStore failed

GRIS

java.net.ConnectException: Connection refused

merge jobmans

both info services (iStore,GRIS) failed

gridlab.conf

sourcing /etc/gridlab.conf
 GRID_SECURITY not defined
 GRID_MAPFILE not defined
 CERTIFICATION_AUTHORITY_DIR not defined
 HDF5_LOCATION not defined
 GRIDLAB_MONITORING_LOCATION not defined
 GRIDLAB_MDS_LOCATION not defined
 GRIDLAB_ADAPTIVE_LOCATION not defined
 CACTUS_LOCATION not defined
 CACTUS_DEV_LOCATION not defined
 GAT_DEV_LOCATION not defined
 TRIANA_LOCATION not defined
 HEADNODE_HOSTNAME not defined
 MPI_NATIVE_DIR MPICH_DIR MPICH_GM_DIR LAM_DIR MPIPRO_DIR not defined
FAILED

Mercury compile

unpacking ...
configuring ...
configure FAILED
last 100 lines of /home/glab010/autotest_mercury/makelog
-------------------------------------
checking sys/utsname.h presence... yes
checking for sys/utsname.h... yes
checking sys/vfs.h usability... yes
checking sys/vfs.h presence... yes
checking for sys/vfs.h... yes
checking termios.h usability... yes
checking termios.h presence... yes
checking for termios.h... yes
checking zlib.h usability... yes
checking zlib.h presence... yes
checking for zlib.h... yes
checking for dirent.h that defines DIR... yes
checking for library containing opendir... none required
checking whether termios.h defines TIOCGWINSZ... no
checking whether sys/ioctl.h defines TIOCGWINSZ... yes
checking sys/select.h usability... yes
checking sys/select.h presence... yes
checking for sys/select.h... yes
checking for fd_set... yes
checking for sys/mount.h... yes
checking for sys/ucred.h... no
checking for net/if.h... yes
checking for net/if_arp.h... yes
checking for net/if_dl.h... no
checking for net/if_types.h... no
checking for size_t... yes
checking for off_t... yes
checking for pid_t... yes
checking return type of signal handlers... void
checking for long... yes
checking size of long... 4
checking for socklen_t... yes
checking for in_addr_t... yes
checking for struct sockaddr.sa_len... no
checking for struct cmsgcred... no
checking for struct fcred... no
checking for struct sockcred... no
checking for struct msghdr.msg_control... yes
checking for SO_PEERCRED... yes
checking for LOCAL_PEERCRED... no
checking for SCM_RIGHTS... yes
checking for library containing if_nametoindex... none required
checking for library containing inet_aton... none required
checking for library containing openpty... -lutil
checking for library containing poll... none required
checking for library containing sem_init... -lrt
checking for library containing shm_open... none required
checking for library containing socketpair... none required
checking for getfsstat... no
checking for getloadavg... yes
checking for getpagesize... yes
checking for getpt... yes
checking for getutent... yes
checking for grantpt... yes
checking for if_nametoindex... yes
checking for issetugid... no
checking for mmap... yes
checking for openpty... yes
checking for poll... yes
checking for posix_openpt... yes
checking for pthread_mutexattr_setpshared... yes
checking for pthread_mutexattr_settype... yes
checking for ptsname_r... yes
checking for select... yes
checking for semget... yes
checking for sem_init... yes
checking for setutent... yes
checking for shmget... yes
checking for shm_open... yes
checking for snprintf... yes
checking for statfs... yes
checking for statvfs... yes
checking for strtoll... yes
checking for strtoull... yes
checking for times... yes
checking for uname... yes
checking for unlockpt... yes
checking for vsnprintf... yes
checking for vsyslog... yes
configure: Using poll() for async I/O
checking for struct sockaddr_storage... yes
checking for struct addrinfo... yes
checking for cfmakeraw... yes
checking for daemon... yes
checking for freeaddrinfo... yes
checking for gai_strerror... yes
checking for getaddrinfo... yes
checking for getnameinfo... yes
checking for inet_aton... yes
checking for inet_ntop... yes
checking for inet_pton... yes
checking for strsep... yes
checking for AF_INET6... yes
checking for getpwuid_r... has 5 args
checking for inflate in -lz... yes
checking for pkg-config... no
checking for GLIB - version >= 1.3.15... no
*** A new enough version of pkg-config was not found.
*** See http://www.freedesktop.org/software/pkgconfig/
configure: error: glib libraries were not found
-------------------------------------

grape.man.poznan.pl

iStore

machine grape.man.poznan.pl not found in iStore

iGrid jobmans

iStore failed

Gatekeeper

Data transfer to the server failed [Root error message: Authentication failed [Root error message: org.ietf.jgss.GSSException, major code: 11, minor code: 0
	major string: General failure, unspecified at GSSAPI level
	minor string: None [Root error message: Bad certificate]]]

gridlab.conf

Gatekeeper failed

java

Gatekeeper failed

Mercury compile

Gatekeeper failed

clean

Gatekeeper failed

glamdring.zcu.cz

iGrid jobmans

No jobmanagers found in iStore for machine glamdring.zcu.cz

GRIS

java.net.ConnectException: Connection refused

merge jobmans

GRIS failed, iStore lists no jobmanagers

Gatekeeper

Data transfer to the server failed [Root error message: null]

gridlab.conf

Gatekeeper failed

java

Gatekeeper failed

Mercury compile

Gatekeeper failed

clean

Gatekeeper failed

sierra0.unile.it

iGrid jobmans

No jobmanagers found in iStore for machine sierra0.unile.it

GRIS

java.net.ConnectException: Connection refused

merge jobmans

GRIS failed, iStore lists no jobmanagers

Gatekeeper

Data transfer to the server failed [Root error message: Authentication failed [Root error message: org.ietf.jgss.GSSException, major code: 11, minor code: 0
	major string: General failure, unspecified at GSSAPI level
	minor string: None [Root error message: Unknown CA]]]

gridlab.conf

Gatekeeper failed

java

Gatekeeper failed

Mercury compile

Gatekeeper failed

clean

Gatekeeper failed

sigma1.unile.it

iGrid jobmans

No jobmanagers found in iStore for machine sigma1.unile.it

GRIS

java.net.ConnectException: Connection refused

merge jobmans

GRIS failed, iStore lists no jobmanagers

Gatekeeper

Data transfer to the server failed [Root error message: Authentication failed [Root error message: org.ietf.jgss.GSSException, major code: 11, minor code: 0
	major string: General failure, unspecified at GSSAPI level
	minor string: None [Root error message: Unknown CA]]]

gridlab.conf

Gatekeeper failed

java

Gatekeeper failed

Mercury compile

Gatekeeper failed

clean

Gatekeeper failed

peyote.aei.mpg.de

iStore

machine peyote.aei.mpg.de not found in iStore

iGrid jobmans

iStore failed

GRIS

java.net.ConnectException: Connection refused

merge jobmans

both info services (iStore,GRIS) failed

Gatekeeper

Authentication with the remote server failed

gridlab.conf

Gatekeeper failed

java

Gatekeeper failed

Mercury compile

Gatekeeper failed

clean

Gatekeeper failed

ibun.ics.muni.cz

iStore

machine ibun.ics.muni.cz not found in iStore

iGrid jobmans

iStore failed

GRIS

java.net.NoRouteToHostException: No route to host

merge jobmans

both info services (iStore,GRIS) failed

Gatekeeper

The connection to the server failed (check host and port) [Root error message: No route to host]

gridlab.conf

Gatekeeper failed

java

Gatekeeper failed

Mercury compile

Gatekeeper failed

clean

Gatekeeper failed

cluster3.zib.de

iStore

machine cluster3.zib.de not found in iStore

iGrid jobmans

iStore failed

GRIS

java.net.ConnectException: Connection refused

merge jobmans

both info services (iStore,GRIS) failed

Gatekeeper

Data transfer to the server failed [Root error message: null]

gridlab.conf

Gatekeeper failed

java

Gatekeeper failed

Mercury compile

Gatekeeper failed

clean

Gatekeeper failed

gridentry.uni-paderborn.de

iStore

machine gridentry.uni-paderborn.de not found in iStore

iGrid jobmans

iStore failed

GRIS

java.net.ConnectException: Connection refused

merge jobmans

both info services (iStore,GRIS) failed

Gatekeeper

Data transfer to the server failed [Root error message: Authentication failed [Root error message: org.ietf.jgss.GSSException, major code: 11, minor code: 0
	major string: General failure, unspecified at GSSAPI level
	minor string: None [Root error message: Bad certificate]]]

gridlab.conf

Gatekeeper failed

java

Gatekeeper failed

Mercury compile

Gatekeeper failed

clean

Gatekeeper failed

sr8000.lrz-muenchen.de

iStore

machine sr8000.lrz-muenchen.de not found in iStore

iGrid jobmans

iStore failed

GRIS

java.net.SocketTimeoutException: connect timed out

merge jobmans

both info services (iStore,GRIS) failed

Gatekeeper

Data transfer to the server failed [Root error message: Authentication failed [Root error message: org.ietf.jgss.GSSException, major code: 11, minor code: 0
	major string: General failure, unspecified at GSSAPI level
	minor string: None [Root error message: Unknown CA]]]

gridlab.conf

disabled

java

disabled

Mercury compile

disabled

clean

disabled

packcs-e0.scai.fraunhofer.de

iStore

machine packcs-e0.scai.fraunhofer.de not found in iStore

iGrid jobmans

iStore failed

GRIS

java.net.ConnectException: Connection refused

merge jobmans

both info services (iStore,GRIS) failed

Gatekeeper

The connection to the server failed (check host and port) [Root error message: Connection refused]

gridlab.conf

Gatekeeper failed

java

Gatekeeper failed

Mercury compile

Gatekeeper failed

clean

Gatekeeper failed

helix.bcvc.lsu.edu

iStore

machine helix.bcvc.lsu.edu not found in iStore

iGrid jobmans

iStore failed

GRIS

java.net.ConnectException: Connection refused

merge jobmans

both info services (iStore,GRIS) failed

Gatekeeper

Data transfer to the server failed [Root error message: null]

gridlab.conf

Gatekeeper failed

java

Gatekeeper failed

Mercury compile

Gatekeeper failed

clean

Gatekeeper failed

venus.gridcenter.or.kr

iStore

machine venus.gridcenter.or.kr not found in iStore

iGrid jobmans

iStore failed

GRIS

java.net.ConnectException: Connection refused

merge jobmans

both info services (iStore,GRIS) failed

Gatekeeper

Data transfer to the server failed [Root error message: Authentication failed [Root error message: org.ietf.jgss.GSSException, major code: 11, minor code: 0
	major string: General failure, unspecified at GSSAPI level
	minor string: None [Root error message: Bad certificate]]]

gridlab.conf

Gatekeeper failed

java

Gatekeeper failed

Mercury compile

Gatekeeper failed

clean

Gatekeeper failed

pclab120.telecom.ece.ntua.gr

iStore

machine pclab120.telecom.ece.ntua.gr not found in iStore

iGrid jobmans

iStore failed

GRIS

java.net.ConnectException: Connection refused

merge jobmans

both info services (iStore,GRIS) failed

Gatekeeper

The connection to the server failed (check host and port) [Root error message: Connection refused]

gridlab.conf

Gatekeeper failed

java

Gatekeeper failed

Mercury compile

Gatekeeper failed

clean

Gatekeeper failed